Reaction Details
TargetNeuropeptide FF receptor 2
LigandBDBM50029118
Substrate/Competitorn/a
Meas. Tech.ChEMBL_1436933 (CHEMBL3388431)
Ki 2773±n/a nM
Citation Journigan, VBMésangeau, CVyas, NEans, SOCutler, SJMcLaughlin, JPMollereau, CMcCurdy, CR Nonpeptide small molecule agonist and antagonist original leads for neuropeptide FF1 and FF2 receptors. J Med Chem57:8903-27 (2014) 
 
Neuropeptide FF receptor 2
Name:Neuropeptide FF receptor 2
Type:Enzyme Catalytic Domain
Mol. Mass.:60293.78
Organism:Homo sapiens (Human)
Description:NPFF2 0 HUMAN::Q9Y5X5
Residue:522
BDBM50029118
NameBDBM50029118
Synonyms:CHEMBL3360837
TypeSmall organic molecule
Emp. Form.C21H29N5
Mol. Mass.351.4885
SMILESNC(=N)NCC1(CCN(CCc2ccccc2)CC1)Nc1ccccc1