Reaction Details
TargetNeuropeptide FF receptor 1
LigandBDBM50029113
Substrate/Competitorn/a
Meas. Tech.ChEMBL_1436237 (CHEMBL3387184)
Ki 2454±n/a nM
Citation Journigan, VBMésangeau, CVyas, NEans, SOCutler, SJMcLaughlin, JPMollereau, CMcCurdy, CR Nonpeptide small molecule agonist and antagonist original leads for neuropeptide FF1 and FF2 receptors. J Med Chem57:8903-27 (2014) 
 
Neuropeptide FF receptor 1
Name:Neuropeptide FF receptor 1
Type:PROTEIN
Mol. Mass.:47840.07
Organism:Homo sapiens (Human)
Description:ChEMBL_1474637
Residue:430
BDBM50029113
NameBDBM50029113
Synonyms:CHEMBL3361412
TypeSmall organic molecule
Emp. Form.C35H52N6O5
Mol. Mass.636.8246
SMILESCC(C)(C)OC(=O)N\C(NCCCCC(=O)NCC1(CCN(Cc2ccccc2)CC1)Nc1ccccc1)=N\C(=O)OC(C)(C)C