Reaction Details
TargetNeuropeptide FF receptor 2
LigandBDBM50029110
Substrate/Competitorn/a
Meas. Tech.ChEMBL_1436239 (CHEMBL3387186)
Ki 84±n/a nM
Citation Journigan, VBMésangeau, CVyas, NEans, SOCutler, SJMcLaughlin, JPMollereau, CMcCurdy, CR Nonpeptide small molecule agonist and antagonist original leads for neuropeptide FF1 and FF2 receptors. J Med Chem57:8903-27 (2014) 
 
Neuropeptide FF receptor 2
Name:Neuropeptide FF receptor 2
Type:Enzyme Catalytic Domain
Mol. Mass.:60293.78
Organism:Homo sapiens (Human)
Description:NPFF2 0 HUMAN::Q9Y5X5
Residue:522
BDBM50029110
NameBDBM50029110
Synonyms:CHEMBL3361423
TypeSmall organic molecule
Emp. Form.C23H31N5O
Mol. Mass.393.5251
SMILESNC(=N)NCC(=O)NCC1(Cc2ccccc2)CCN(Cc2ccccc2)CC1