Reaction Details
TargetNeuropeptide FF receptor 2
LigandBDBM50029123
Substrate/Competitorn/a
Meas. Tech.ChEMBL_1436239 (CHEMBL3387186)
Ki 2757±n/a nM
Citation Journigan, VBMésangeau, CVyas, NEans, SOCutler, SJMcLaughlin, JPMollereau, CMcCurdy, CR Nonpeptide small molecule agonist and antagonist original leads for neuropeptide FF1 and FF2 receptors. J Med Chem57:8903-27 (2014) 
 
Neuropeptide FF receptor 2
Name:Neuropeptide FF receptor 2
Type:Enzyme Catalytic Domain
Mol. Mass.:60293.78
Organism:Homo sapiens (Human)
Description:NPFF2 0 HUMAN::Q9Y5X5
Residue:522
BDBM50029123
NameBDBM50029123
Synonyms:CHEMBL3361426
TypeSmall organic molecule
Emp. Form.C15H24N6O
Mol. Mass.304.3907
SMILESNC(=N)NCC(=O)NCC1(CCNCC1)Nc1ccccc1