Reaction Details
TargetNeuropeptide FF receptor 1
LigandBDBM50029183
Substrate/Competitorn/a
Meas. Tech.ChEMBL_1436237 (CHEMBL3387184)
Ki 487±n/a nM
Citation Journigan, VBMésangeau, CVyas, NEans, SOCutler, SJMcLaughlin, JPMollereau, CMcCurdy, CR Nonpeptide small molecule agonist and antagonist original leads for neuropeptide FF1 and FF2 receptors. J Med Chem57:8903-27 (2014) 
 
Neuropeptide FF receptor 1
Name:Neuropeptide FF receptor 1
Type:PROTEIN
Mol. Mass.:47840.07
Organism:Homo sapiens (Human)
Description:ChEMBL_1474637
Residue:430
BDBM50029183
NameBDBM50029183
Synonyms:CHEMBL3360832
TypeSmall organic molecule
Emp. Form.C25H37N7O
Mol. Mass.451.6076
SMILESN[C@@H](CCCNC(N)=N)C(=O)NCC1(CCN(Cc2ccccc2)CC1)Nc1ccccc1