Reaction Details
TargetNeuropeptide FF receptor 1
LigandBDBM50029187
Substrate/Competitorn/a
Meas. Tech.ChEMBL_1436237 (CHEMBL3387184)
Ki 1880±n/a nM
Citation Journigan, VBMésangeau, CVyas, NEans, SOCutler, SJMcLaughlin, JPMollereau, CMcCurdy, CR Nonpeptide small molecule agonist and antagonist original leads for neuropeptide FF1 and FF2 receptors. J Med Chem57:8903-27 (2014) 
 
Neuropeptide FF receptor 1
Name:Neuropeptide FF receptor 1
Type:PROTEIN
Mol. Mass.:47840.07
Organism:Homo sapiens (Human)
Description:ChEMBL_1474637
Residue:430
BDBM50029187
NameBDBM50029187
Synonyms:CHEMBL3360836
TypeSmall organic molecule
Emp. Form.C20H27N5
Mol. Mass.337.4619
SMILESNC(=N)NCC1(CCN(Cc2ccccc2)CC1)Nc1ccccc1