Reaction Details
TargetNeuropeptide FF receptor 1
LigandBDBM50029118
Substrate/Competitorn/a
Meas. Tech.ChEMBL_1436237 (CHEMBL3387184)
Ki 2965±n/a nM
Citation Journigan, VBMésangeau, CVyas, NEans, SOCutler, SJMcLaughlin, JPMollereau, CMcCurdy, CR Nonpeptide small molecule agonist and antagonist original leads for neuropeptide FF1 and FF2 receptors. J Med Chem57:8903-27 (2014) 
 
Neuropeptide FF receptor 1
Name:Neuropeptide FF receptor 1
Type:PROTEIN
Mol. Mass.:47840.07
Organism:Homo sapiens (Human)
Description:ChEMBL_1474637
Residue:430
BDBM50029118
NameBDBM50029118
Synonyms:CHEMBL3360837
TypeSmall organic molecule
Emp. Form.C21H29N5
Mol. Mass.351.4885
SMILESNC(=N)NCC1(CCN(CCc2ccccc2)CC1)Nc1ccccc1