Reaction Details
TargetNeuropeptide FF receptor 1
LigandBDBM50029138
Substrate/Competitorn/a
Meas. Tech.ChEMBL_1436238 (CHEMBL3387185)
Ki 3.9±n/a nM
Citation Journigan, VBMésangeau, CVyas, NEans, SOCutler, SJMcLaughlin, JPMollereau, CMcCurdy, CR Nonpeptide small molecule agonist and antagonist original leads for neuropeptide FF1 and FF2 receptors. J Med Chem57:8903-27 (2014) 
 
Neuropeptide FF receptor 1
Name:Neuropeptide FF receptor 1
Type:PROTEIN
Mol. Mass.:47840.07
Organism:Homo sapiens (Human)
Description:ChEMBL_1474637
Residue:430
BDBM50029138
NameBDBM50029138
Synonyms:CHEMBL3360830
TypeSmall organic molecule
Emp. Form.C55H78N14O11
Mol. Mass.1111.295
SMILESCC(C)C[C@@H](N(C)C(=O)[C@H](N)Cc1ccc(O)cc1)C(=O)N[C@@H](Cc1ccccc1)C(=O)N[C@@H](CCC(N)=O)C(=O)N1CCC[C@H]1C(=O)N[C@@H](CCC(N)=O)C(=O)N[C@@H](CCCNC(N)=N)C(=O)N[C@@H](Cc1ccccc1)C(N)=O