Reaction Details
TargetNeuropeptide FF receptor 1
LigandBDBM50029330
Substrate/Competitorn/a
Meas. Tech.ChEMBL_1436238 (CHEMBL3387185)
Ki 904±n/a nM
Citation Journigan, VBMésangeau, CVyas, NEans, SOCutler, SJMcLaughlin, JPMollereau, CMcCurdy, CR Nonpeptide small molecule agonist and antagonist original leads for neuropeptide FF1 and FF2 receptors. J Med Chem57:8903-27 (2014) 
 
Neuropeptide FF receptor 1
Name:Neuropeptide FF receptor 1
Type:PROTEIN
Mol. Mass.:47840.07
Organism:Homo sapiens (Human)
Description:ChEMBL_1474637
Residue:430
BDBM50029330
NameBDBM50029330
Synonyms:CHEMBL3361417
TypeSmall organic molecule
Emp. Form.C23H32N6O
Mol. Mass.408.5398
SMILESNC(=N)NCC(=O)NCC1(CCCN(Cc2ccccc2)C1)NCc1ccccc1