Reaction Details
TargetMu-type opioid receptor
LigandBDBM50029183
Substrate/Competitorn/a
Meas. Tech.ChEMBL_1436242 (CHEMBL3387189)
Ki 3.4±n/a nM
Citation Journigan, VBMésangeau, CVyas, NEans, SOCutler, SJMcLaughlin, JPMollereau, CMcCurdy, CR Nonpeptide small molecule agonist and antagonist original leads for neuropeptide FF1 and FF2 receptors. J Med Chem57:8903-27 (2014) 
 
Mu-type opioid receptor
Name:Mu-type opioid receptor
Type:G Protein-Coupled Receptor (GPCR)
Mol. Mass.:44789.51
Organism:Homo sapiens (Human)
Description:P35372
Residue:400
BDBM50029183
NameBDBM50029183
Synonyms:CHEMBL3360832
TypeSmall organic molecule
Emp. Form.C25H37N7O
Mol. Mass.451.6076
SMILESN[C@@H](CCCNC(N)=N)C(=O)NCC1(CCN(Cc2ccccc2)CC1)Nc1ccccc1