Reaction Details
TargetMu-type opioid receptor
LigandBDBM50029096
Substrate/Competitorn/a
Meas. Tech.ChEMBL_1436242 (CHEMBL3387189)
Ki 201±n/a nM
Citation Journigan, VBMésangeau, CVyas, NEans, SOCutler, SJMcLaughlin, JPMollereau, CMcCurdy, CR Nonpeptide small molecule agonist and antagonist original leads for neuropeptide FF1 and FF2 receptors. J Med Chem57:8903-27 (2014) 
 
Mu-type opioid receptor
Name:Mu-type opioid receptor
Type:G Protein-Coupled Receptor (GPCR)
Mol. Mass.:44789.51
Organism:Homo sapiens (Human)
Description:P35372
Residue:400
BDBM50029096
NameBDBM50029096
Synonyms:CHEMBL3361425
TypeSmall organic molecule
Emp. Form.C22H30N6O
Mol. Mass.394.5132
SMILESNC(=N)NCCNC(=O)C1(CCN(Cc2ccccc2)CC1)Nc1ccccc1