Reaction Details
TargetDelta-type opioid receptor
LigandBDBM50029097
Substrate/Competitorn/a
Meas. Tech.ChEMBL_1436243 (CHEMBL3387190)
Ki 2607±n/a nM
Citation Journigan, VBMésangeau, CVyas, NEans, SOCutler, SJMcLaughlin, JPMollereau, CMcCurdy, CR Nonpeptide small molecule agonist and antagonist original leads for neuropeptide FF1 and FF2 receptors. J Med Chem57:8903-27 (2014) 
 
Delta-type opioid receptor
Name:Delta-type opioid receptor
Type:G Protein-Coupled Receptor (GPCR)
Mol. Mass.:40382.98
Organism:Homo sapiens (Human)
Description:Competition binding assays were carried out using membrane preparations from transfected HN9.10 cells that constitutively expressed the delta opioid receptor.
Residue:372
BDBM50029097
NameBDBM50029097
Synonyms:CHEMBL3361433
TypeSmall organic molecule
Emp. Form.C27H33N5O
Mol. Mass.443.5838
SMILESNC(=N)NCC(=O)NCC1(Cc2cccc3ccccc23)CCN(Cc2ccccc2)CC1