Reaction Details
TargetKappa-type opioid receptor
LigandBDBM50029336
Substrate/Competitorn/a
Meas. Tech.ChEMBL_1436244 (CHEMBL3387191)
Ki 1233±n/a nM
Citation Journigan, VBMésangeau, CVyas, NEans, SOCutler, SJMcLaughlin, JPMollereau, CMcCurdy, CR Nonpeptide small molecule agonist and antagonist original leads for neuropeptide FF1 and FF2 receptors. J Med Chem57:8903-27 (2014) 
 
Kappa-type opioid receptor
Name:Kappa-type opioid receptor
Type:G Protein-Coupled Receptor (GPCR)
Mol. Mass.:42648.76
Organism:Homo sapiens (Human)
Description:P41145
Residue:380
BDBM50029336
NameBDBM50029336
Synonyms:CHEMBL3361416
TypeSmall organic molecule
Emp. Form.C22H30N6O
Mol. Mass.394.5132
SMILESNC(=N)NCC(=O)NCC1(CCN(Cc2ccccc2)CC1)Nc1ccccc1