Reaction Details
TargetAurora kinase A
LigandBDBM50029437
Substrate/Competitorn/a
Meas. Tech.ChEMBL_1436940 (CHEMBL3388438)
IC50 496±n/a nM
Citation Cai, JLi, LHong, KHWu, XChen, JWang, PCao, MZong, XJi, M Discovery of 4-aminoquinazoline--urea derivatives as Aurora kinase inhibitors with antiproliferative activity. Bioorg Med Chem22:5813-23 (2014) 
 
Aurora kinase A
Name:Aurora kinase A
Type:Serine/threonine-protein kinase
Mol. Mass.:45830.98
Organism:Homo sapiens (Human)
Description:O14965
Residue:403
BDBM50029437
NameBDBM50029437
Synonyms:CHEMBL3343316
TypeSmall organic molecule
Emp. Form.C31H39N7O3
Mol. Mass.557.6865
SMILESOCCN1CCN(CCCOC2=CC3N=CN=C(Nc4ccc(NC(=O)NCc5ccccc5)cc4)C3C=C2)CC1