Reaction Details
TargetAurora kinase B
LigandBDBM50029367
Substrate/Competitorn/a
Meas. Tech.ChEMBL_1436941 (CHEMBL3388439)
IC50 289±n/a nM
Citation Cai, JLi, LHong, KHWu, XChen, JWang, PCao, MZong, XJi, M Discovery of 4-aminoquinazoline--urea derivatives as Aurora kinase inhibitors with antiproliferative activity. Bioorg Med Chem22:5813-23 (2014) 
 
Aurora kinase B
Name:Aurora kinase B
Type:Protein
Mol. Mass.:39327.72
Organism:Homo sapiens (Human)
Description:Q96GD4
Residue:344
BDBM50029367
NameBDBM50029367
Synonyms:CHEMBL3343309
TypeSmall organic molecule
Emp. Form.C30H35N7O2
Mol. Mass.525.6446
SMILESCN1CCN(CCCOc2ccc3c(Nc4ccc(NC(=O)NCc5ccccc5)cc4)ncnc3c2)CC1