Reaction Details
TargetAurora kinase B
LigandBDBM50029429
Substrate/Competitorn/a
Meas. Tech.ChEMBL_1436941 (CHEMBL3388439)
IC50 196±n/a nM
Citation Cai, JLi, LHong, KHWu, XChen, JWang, PCao, MZong, XJi, M Discovery of 4-aminoquinazoline--urea derivatives as Aurora kinase inhibitors with antiproliferative activity. Bioorg Med Chem22:5813-23 (2014) 
 
Aurora kinase B
Name:Aurora kinase B
Type:Protein
Mol. Mass.:39327.72
Organism:Homo sapiens (Human)
Description:Q96GD4
Residue:344
BDBM50029429
NameBDBM50029429
Synonyms:CHEMBL3343313
TypeSmall organic molecule
Emp. Form.C29H36N6O2
Mol. Mass.500.6351
SMILESCCN(CC)CCCOC1=CC2N=CN=C(Nc3ccc(NC(=O)NCc4ccccc4)cc3)C2C=C1