Reaction Details
TargetAurora kinase B
LigandBDBM50029439
Substrate/Competitorn/a
Meas. Tech.ChEMBL_1436941 (CHEMBL3388439)
IC50 783±n/a nM
Citation Cai, JLi, LHong, KHWu, XChen, JWang, PCao, MZong, XJi, M Discovery of 4-aminoquinazoline--urea derivatives as Aurora kinase inhibitors with antiproliferative activity. Bioorg Med Chem22:5813-23 (2014) 
 
Aurora kinase B
Name:Aurora kinase B
Type:Protein
Mol. Mass.:39327.72
Organism:Homo sapiens (Human)
Description:Q96GD4
Residue:344
BDBM50029439
NameBDBM50029439
Synonyms:CHEMBL3343317
TypeSmall organic molecule
Emp. Form.C31H38N6O3
Mol. Mass.542.6718
SMILESOCC1CCN(CCCOC2=CC3N=CN=C(Nc4ccc(NC(=O)NCc5ccccc5)cc4)C3C=C2)CC1