Reaction Details
TargetAurora kinase B
LigandBDBM50029459
Substrate/Competitorn/a
Meas. Tech.ChEMBL_1436944 (CHEMBL3388442)
IC50 130±n/a nM
Citation Cai, JLi, LHong, KHWu, XChen, JWang, PCao, MZong, XJi, M Discovery of 4-aminoquinazoline--urea derivatives as Aurora kinase inhibitors with antiproliferative activity. Bioorg Med Chem22:5813-23 (2014) 
 
Aurora kinase B
Name:Aurora kinase B
Type:Protein
Mol. Mass.:39327.72
Organism:Homo sapiens (Human)
Description:Q96GD4
Residue:344
BDBM50029459
NameBDBM50029459
Synonyms:CHEMBL3343420
TypeSmall organic molecule
Emp. Form.C29H33N5O4
Mol. Mass.515.6034
SMILESCOC1=CC2C(C=C1OCCCN1CCOCC1)N=CN=C2Nc1ccc(NC(=O)c2ccccc2)cc1