Reaction Details
TargetIsocitrate dehydrogenase [NADP] cytoplasmic
LigandBDBM50029483
Substrate/Competitorn/a
Meas. Tech.ChEMBL_1436945 (CHEMBL3388443)
Ki 950±n/a nM
Citation Liu, ZYao, YKogiso, MZheng, BDeng, LQiu, JJDong, SLv, HGallo, JMLi, XNSong, Y Inhibition of cancer-associated mutant isocitrate dehydrogenases: synthesis, structure-activity relationship, and selective antitumor activity. J Med Chem57:8307-18 (2014) 
 
Isocitrate dehydrogenase [NADP] cytoplasmic
Name:Isocitrate dehydrogenase [NADP] cytoplasmic
Type:Protein
Mol. Mass.:46661.29
Organism:Homo sapiens (Human)
Description:O75874
Residue:414
BDBM50029483
NameBDBM50029483
Synonyms:CHEMBL3343458
TypeSmall organic molecule
Emp. Form.C17H15NO2
Mol. Mass.265.3065
SMILESCc1cc(Cc2cccc3ccccc23)n(O)c(=O)c1