Reaction Details
TargetIsocitrate dehydrogenase [NADP] cytoplasmic
LigandBDBM50434278
Substrate/Competitorn/a
Meas. Tech.ChEMBL_1436946 (CHEMBL3388444)
Ki>50000±n/a nM
Citation Liu, ZYao, YKogiso, MZheng, BDeng, LQiu, JJDong, SLv, HGallo, JMLi, XNSong, Y Inhibition of cancer-associated mutant isocitrate dehydrogenases: synthesis, structure-activity relationship, and selective antitumor activity. J Med Chem57:8307-18 (2014) 
 
Isocitrate dehydrogenase [NADP] cytoplasmic
Name:Isocitrate dehydrogenase [NADP] cytoplasmic
Type:Protein
Mol. Mass.:46661.29
Organism:Homo sapiens (Human)
Description:O75874
Residue:414
BDBM50434278
NameBDBM50434278
Synonyms:CHEMBL2386126
TypeSmall organic molecule
Emp. Form.C13H13NO2
Mol. Mass.215.2478
SMILESCc1cc(Cc2ccccc2)n(O)c(=O)c1