Reaction Details
TargetIsocitrate dehydrogenase [NADP] cytoplasmic
LigandBDBM50434275
Substrate/Competitorn/a
Meas. Tech.ChEMBL_1436947 (CHEMBL3389006)
Ki 270±n/a nM
Citation Liu, ZYao, YKogiso, MZheng, BDeng, LQiu, JJDong, SLv, HGallo, JMLi, XNSong, Y Inhibition of cancer-associated mutant isocitrate dehydrogenases: synthesis, structure-activity relationship, and selective antitumor activity. J Med Chem57:8307-18 (2014) 
 
Isocitrate dehydrogenase [NADP] cytoplasmic
Name:Isocitrate dehydrogenase [NADP] cytoplasmic
Type:Protein
Mol. Mass.:46661.29
Organism:Homo sapiens (Human)
Description:O75874
Residue:414
BDBM50434275
NameBDBM50434275
Synonyms:CHEMBL2386128
TypeSmall organic molecule
Emp. Form.C12H11NO2
Mol. Mass.201.2212
SMILESOn1c(Cc2ccccc2)cccc1=O