Reaction Details
TargetIsocitrate dehydrogenase [NADP] cytoplasmic
LigandBDBM50029463
Substrate/Competitorn/a
Meas. Tech.ChEMBL_1436950 (CHEMBL3389009)
IC50 1100±n/a nM
Citation Liu, ZYao, YKogiso, MZheng, BDeng, LQiu, JJDong, SLv, HGallo, JMLi, XNSong, Y Inhibition of cancer-associated mutant isocitrate dehydrogenases: synthesis, structure-activity relationship, and selective antitumor activity. J Med Chem57:8307-18 (2014) 
 
Isocitrate dehydrogenase [NADP] cytoplasmic
Name:Isocitrate dehydrogenase [NADP] cytoplasmic
Type:Protein
Mol. Mass.:46661.29
Organism:Homo sapiens (Human)
Description:O75874
Residue:414
BDBM50029463
NameBDBM50029463
Synonyms:CHEMBL3343444
TypeSmall organic molecule
Emp. Form.C14H15NO3
Mol. Mass.245.2738
SMILESCOc1cccc(Cc2cc(C)cc(=O)n2O)c1