Reaction Details
TargetIsocitrate dehydrogenase [NADP] cytoplasmic
LigandBDBM50434276
Substrate/Competitorn/a
Meas. Tech.ChEMBL_1436945 (CHEMBL3388443)
Ki 8200±n/a nM
Citation Liu, ZYao, YKogiso, MZheng, BDeng, LQiu, JJDong, SLv, HGallo, JMLi, XNSong, Y Inhibition of cancer-associated mutant isocitrate dehydrogenases: synthesis, structure-activity relationship, and selective antitumor activity. J Med Chem57:8307-18 (2014) 
 
Isocitrate dehydrogenase [NADP] cytoplasmic
Name:Isocitrate dehydrogenase [NADP] cytoplasmic
Type:Protein
Mol. Mass.:46661.29
Organism:Homo sapiens (Human)
Description:O75874
Residue:414
BDBM50434276
NameBDBM50434276
Synonyms:CHEMBL2386125
TypeSmall organic molecule
Emp. Form.C12H13NO2
Mol. Mass.203.2371
SMILESOC1C=CC(Cc2ccccc2)=CN1O