Reaction Details
TargetBroad substrate specificity ATP-binding cassette transporter ABCG2
LigandBDBM50029739
Substrate/Competitorn/a
Meas. Tech.ChEMBL_1437665 (CHEMBL3381155)
IC50 230±n/a nM
Citation Jabor Gozzi, GBouaziz, ZWinter, EDaflon-Yunes, NAichele, DNacereddine, AMarminon, CValdameri, GZeinyeh, WBollacke, AGuillon, JLacoudre, APinaud, NCadena, SMJose, JLe Borgne, MDi Pietro, A Converting potent indeno[1,2-b]indole inhibitors of protein kinase CK2 into selective inhibitors of the breast cancer resistance protein ABCG2. J Med Chem58:265-77 (2015) 
 
Broad substrate specificity ATP-binding cassette transporter ABCG2
Name:Broad substrate specificity ATP-binding cassette transporter ABCG2
Type:Multi-pass membrane protein; monomer or homodimer; disulfide-linked
Mol. Mass.:72329.48
Organism:Homo sapiens (Human)
Description:Q9UNQ0
Residue:655
BDBM50029739
NameBDBM50029739
Synonyms:CHEMBL3353414
TypeSmall organic molecule
Emp. Form.C24H21NO2
Mol. Mass.355.429
SMILESCC1Cc2c(c3C(=O)c4ccccc4-c3n2CCc2ccccc2)C(=O)C1