Reaction Details
TargetCannabinoid receptor 2
LigandBDBM50029958
Substrate/Competitorn/a
Meas. Tech.ChEMBL_1438384 (CHEMBL3383059)
IC50 0.720000±n/a nM
Citation Lucchesi, VHurst, DPShore, DMBertini, SEhrmann, BMAllarà, MLawrence, LLigresti, AMinutolo, FSaccomanni, GSharir, HMacchia, MDi Marzo, VAbood, MEReggio, PHManera, C CB2-selective cannabinoid receptor ligands: synthesis, pharmacological evaluation, and molecular modeling investigation of 1,8-Naphthyridin-2(1H)-one-3-carboxamides. J Med Chem57:8777-91 (2014) 
 
Cannabinoid receptor 2
Name:Cannabinoid receptor 2
Type:G Protein-Coupled Receptor (GPCR)
Mol. Mass.:39690.94
Organism:Homo sapiens (Human)
Description:P34972
Residue:360
BDBM50029958
NameBDBM50029958
Synonyms:CHEMBL3353439
TypeSmall organic molecule
Emp. Form.C23H23BrFN3O2
Mol. Mass.472.35
SMILESCC1CCC(CC1)NC(=O)c1cc2cc(Br)cnc2n(Cc2ccc(F)cc2)c1=O