Reaction Details
TargetCannabinoid receptor 1
LigandBDBM50029963
Substrate/Competitorn/a
Meas. Tech.ChEMBL_1438383 (CHEMBL3383058)
Ki 33±n/a nM
Citation Lucchesi, VHurst, DPShore, DMBertini, SEhrmann, BMAllarà, MLawrence, LLigresti, AMinutolo, FSaccomanni, GSharir, HMacchia, MDi Marzo, VAbood, MEReggio, PHManera, C CB2-selective cannabinoid receptor ligands: synthesis, pharmacological evaluation, and molecular modeling investigation of 1,8-Naphthyridin-2(1H)-one-3-carboxamides. J Med Chem57:8777-91 (2014) 
 
Cannabinoid receptor 1
Name:Cannabinoid receptor 1
Type:G Protein-Coupled Receptor (GPCR)
Mol. Mass.:52868.96
Organism:Homo sapiens (Human)
Description:P21554
Residue:472
BDBM50029963
NameBDBM50029963
Synonyms:CHEMBL3353452
TypeSmall organic molecule
Emp. Form.C26H32N4O3S
Mol. Mass.480.622
SMILESCC1CCC(CC1)NC(=O)c1cc2cc(cnc2n(CCN2CCOCC2)c1=O)-c1cccs1