Reaction Details
TargetMuscarinic acetylcholine receptor M2
LigandBDBM50030242
Substrate/Competitorn/a
Meas. Tech.ChEMBL_1438414 (CHEMBL3383643)
Ki 85±n/a nM
Citation Bonifazi, AYano, HDel Bello, FFarande, AQuaglia, WPetrelli, RMatucci, RNesi, MVistoli, GFerré, SPiergentili, A Synthesis and biological evaluation of a novel series of heterobivalent muscarinic ligands based on xanomeline and 1-[3-(4-butylpiperidin-1-yl)propyl]-1,2,3,4-tetrahydroquinolin-2-one (77-LH-28-1). J Med Chem57:9065-77 (2014) 
 
Muscarinic acetylcholine receptor M2
Name:Muscarinic acetylcholine receptor M2
Type:GPCR
Mol. Mass.:51730.61
Organism:Homo sapiens (Human)
Description:P08172
Residue:466
BDBM50030242
NameBDBM50030242
Synonyms:CHEMBL3354071
TypeSmall organic molecule
Emp. Form.C38H59N5O2S
Mol. Mass.649.972
SMILESCN1CCC=C(C1)c1nsnc1OCCCCCCCCCCCCCC1CCN(CCCN2C(=O)CCc3ccccc23)CC1