Reaction Details
TargetMuscarinic acetylcholine receptor M3
LigandBDBM50030249
Substrate/Competitorn/a
Meas. Tech.ChEMBL_1438415 (CHEMBL3383644)
Ki 339±n/a nM
Citation Bonifazi, AYano, HDel Bello, FFarande, AQuaglia, WPetrelli, RMatucci, RNesi, MVistoli, GFerré, SPiergentili, A Synthesis and biological evaluation of a novel series of heterobivalent muscarinic ligands based on xanomeline and 1-[3-(4-butylpiperidin-1-yl)propyl]-1,2,3,4-tetrahydroquinolin-2-one (77-LH-28-1). J Med Chem57:9065-77 (2014) 
 
Muscarinic acetylcholine receptor M3
Name:Muscarinic acetylcholine receptor M3
Type:Enzyme
Mol. Mass.:66151.03
Organism:Homo sapiens (Human)
Description:P20309
Residue:590
BDBM50030249
NameBDBM50030249
Synonyms:CHEMBL3354077
TypeSmall organic molecule
Emp. Form.C30H50N2O2
Mol. Mass.470.7302
1CCN(CCCN2C(=O)CCc3ccccc23)CC1