Reaction Details
TargetMuscarinic acetylcholine receptor M5
LigandBDBM50030251
Substrate/Competitorn/a
Meas. Tech.ChEMBL_1438417 (CHEMBL3383646)
Ki 49±n/a nM
Citation Bonifazi, AYano, HDel Bello, FFarande, AQuaglia, WPetrelli, RMatucci, RNesi, MVistoli, GFerré, SPiergentili, A Synthesis and biological evaluation of a novel series of heterobivalent muscarinic ligands based on xanomeline and 1-[3-(4-butylpiperidin-1-yl)propyl]-1,2,3,4-tetrahydroquinolin-2-one (77-LH-28-1). J Med Chem57:9065-77 (2014) 
 
Muscarinic acetylcholine receptor M5
Name:Muscarinic acetylcholine receptor M5
Type:PROTEIN
Mol. Mass.:60102.35
Organism:Homo sapiens (Human)
Description:ChEMBL_1517990
Residue:532
BDBM50030251
NameBDBM50030251
Synonyms:CHEMBL3354078
TypeSmall organic molecule
Emp. Form.C43H64N4O2
Mol. Mass.668.9939
SMILESO=C1CCc2ccccc2N1CCCN1CCC(CCCCCCCCCC2CCN(CCCN3C(=O)CCc4ccccc34)CC2)CC1