Reaction Details
TargetMuscarinic acetylcholine receptor M1
LigandBDBM50003359
Substrate/Competitorn/a
Meas. Tech.ChEMBL_1438418 (CHEMBL3383647)
EC50 16±n/a nM
Citation Bonifazi, AYano, HDel Bello, FFarande, AQuaglia, WPetrelli, RMatucci, RNesi, MVistoli, GFerré, SPiergentili, A Synthesis and biological evaluation of a novel series of heterobivalent muscarinic ligands based on xanomeline and 1-[3-(4-butylpiperidin-1-yl)propyl]-1,2,3,4-tetrahydroquinolin-2-one (77-LH-28-1). J Med Chem57:9065-77 (2014) 
 
Muscarinic acetylcholine receptor M1
Name:Muscarinic acetylcholine receptor M1
Type:Protein
Mol. Mass.:51442.54
Organism:Homo sapiens (Human)
Description:P11229
Residue:460
BDBM50003359
NameBDBM50003359
Synonyms:5-(4-Hexyloxy-[1,2,5]thiadiazol-3-yl)-1-methyl-1,2,3,6-tetrahydro-pyridine; oxalic acid CHEMBL21536 LY 246708 | Xanomeline
TypeSmall organic molecule
Emp. Form.C14H23N3OS
Mol. Mass.281.417
SMILESCCCCCCOc1nsnc1C1=CCCN(C)C1