Reaction Details
TargetMuscarinic acetylcholine receptor M1
LigandBDBM50030224
Substrate/Competitorn/a
Meas. Tech.ChEMBL_1438420 (CHEMBL3383649)
IC50 14125±n/a nM
Citation Bonifazi, AYano, HDel Bello, FFarande, AQuaglia, WPetrelli, RMatucci, RNesi, MVistoli, GFerré, SPiergentili, A Synthesis and biological evaluation of a novel series of heterobivalent muscarinic ligands based on xanomeline and 1-[3-(4-butylpiperidin-1-yl)propyl]-1,2,3,4-tetrahydroquinolin-2-one (77-LH-28-1). J Med Chem57:9065-77 (2014) 
 
Muscarinic acetylcholine receptor M1
Name:Muscarinic acetylcholine receptor M1
Type:Protein
Mol. Mass.:51442.54
Organism:Homo sapiens (Human)
Description:P11229
Residue:460
BDBM50030224
NameBDBM50030224
Synonyms:CHEMBL3354069
TypeSmall organic molecule
Emp. Form.C34H51N5O2S
Mol. Mass.593.866
SMILESCN1CCC=C(C1)c1nsnc1OCCCCCCCCCC1CCN(CCCN2C(=O)CCc3ccccc23)CC1