Reaction Details
TargetMuscarinic acetylcholine receptor M1
LigandBDBM50452855
Substrate/Competitorn/a
Meas. Tech.ChEMBL_1438420 (CHEMBL3383649)
IC50 1.7±n/a nM
Citation Bonifazi, AYano, HDel Bello, FFarande, AQuaglia, WPetrelli, RMatucci, RNesi, MVistoli, GFerré, SPiergentili, A Synthesis and biological evaluation of a novel series of heterobivalent muscarinic ligands based on xanomeline and 1-[3-(4-butylpiperidin-1-yl)propyl]-1,2,3,4-tetrahydroquinolin-2-one (77-LH-28-1). J Med Chem57:9065-77 (2014) 
 
Muscarinic acetylcholine receptor M1
Name:Muscarinic acetylcholine receptor M1
Type:Protein
Mol. Mass.:51442.54
Organism:Homo sapiens (Human)
Description:P11229
Residue:460
BDBM50452855
NameBDBM50452855
Synonyms:Isoptpo Hyoscine | Scopolamine
TypeSmall organic molecule
Emp. Form.C17H21NO4
Mol. Mass.303.3529
SMILES[H][C@@]12O[C@@]1([H])[C@]1([H])C[C@@H](C[C@@]2([H])N1C)OC(=O)[C@H](CO)c1ccccc1