Reaction Details
TargetMuscarinic acetylcholine receptor M5
LigandBDBM50030223
Substrate/Competitorn/a
Meas. Tech.ChEMBL_1438417 (CHEMBL3383646)
Ki 2.3±n/a nM
Citation Bonifazi, AYano, HDel Bello, FFarande, AQuaglia, WPetrelli, RMatucci, RNesi, MVistoli, GFerré, SPiergentili, A Synthesis and biological evaluation of a novel series of heterobivalent muscarinic ligands based on xanomeline and 1-[3-(4-butylpiperidin-1-yl)propyl]-1,2,3,4-tetrahydroquinolin-2-one (77-LH-28-1). J Med Chem57:9065-77 (2014) 
 
Muscarinic acetylcholine receptor M5
Name:Muscarinic acetylcholine receptor M5
Type:PROTEIN
Mol. Mass.:60102.35
Organism:Homo sapiens (Human)
Description:ChEMBL_1517990
Residue:532
BDBM50030223
NameBDBM50030223
Synonyms:CHEMBL3354068
TypeSmall organic molecule
Emp. Form.C32H47N5O2S
Mol. Mass.565.813
SMILESCN1CCC=C(C1)c1nsnc1OCCCCCCCC1CCN(CCCN2C(=O)CCc3ccccc23)CC1