Reaction Details
TargetBaculoviral IAP repeat-containing protein 2
LigandBDBM50030280
Substrate/Competitorn/a
Meas. Tech.ChEMBL_1439912 (CHEMBL3388612)
IC50 15±n/a nM
Citation Kim, KSZhang, LWilliams, DPerez, HLStang, EBorzilleri, RMPosy, SLei, MChaudhry, CEmanuel, STalbott, R Discovery of tetrahydroisoquinoline-based bivalent heterodimeric IAP antagonists. Bioorg Med Chem Lett24:5022-9 (2014) 
 
Baculoviral IAP repeat-containing protein 2
Name:Baculoviral IAP repeat-containing protein 2
Type:Protein
Mol. Mass.:69900.47
Organism:Homo sapiens (Human)
Description:Q13490
Residue:618
BDBM50030280
NameBDBM50030280
Synonyms:CHEMBL3339214 | US9783573, Example 10
TypeSmall organic molecule
Emp. Form.C63H82N10O8
Mol. Mass.1107.3874
SMILESCN[C@@H](C)C(=O)N[C@H](C(=O)N1C[C@H](C[C@H]1C(=O)N[C@@H]1CCCc2ccccc12)NC(=O)c1ccc(cc1)C(=O)Nc1ccc2C[C@H](N(Cc2c1)C(=O)[C@@H](NC(=O)[C@H](C)NC)C(C)(C)C)C(=O)N[C@@H]1CCCc2ccccc12)C(C)(C)C