Reaction Details
TargetBifunctional chorismate mutase/prephenate dehydratase
LigandBDBM50030317
Substrate/Competitorn/a
Meas. Tech.ChEMBL_1431488 (CHEMBL3389853)
IC50 200000±n/a nM
Citation Meneely, KMLuo, QRiley, APTaylor, BRoy, AStein, RLPrisinzano, TELamb, AL Expanding the results of a high throughput screen against an isochorismate-pyruvate lyase to enzymes of a similar scaffold or mechanism. Bioorg Med Chem22:5961-9 (2014) 
 
Bifunctional chorismate mutase/prephenate dehydratase
Name:Bifunctional chorismate mutase/prephenate dehydratase
Type:PROTEIN
Mol. Mass.:43112.35
Organism:Escherichia coli (strain K12)
Description:ChEMBL_109500
Residue:386
BDBM50030317
NameBDBM50030317
Synonyms:CHEMBL1800324
TypeSmall organic molecule
Emp. Form.C14H10BrNO6S
Mol. Mass.400.201
SMILESOC(=O)c1ccccc1NS(=O)(=O)c1ccc(Br)c(c1)C(O)=O