Reaction Details
TargetBifunctional chorismate mutase/prephenate dehydratase
LigandBDBM50030315
Substrate/Competitorn/a
Meas. Tech.ChEMBL_1431488 (CHEMBL3389853)
IC50 120000±n/a nM
Citation Meneely, KMLuo, QRiley, APTaylor, BRoy, AStein, RLPrisinzano, TELamb, AL Expanding the results of a high throughput screen against an isochorismate-pyruvate lyase to enzymes of a similar scaffold or mechanism. Bioorg Med Chem22:5961-9 (2014) 
 
Bifunctional chorismate mutase/prephenate dehydratase
Name:Bifunctional chorismate mutase/prephenate dehydratase
Type:PROTEIN
Mol. Mass.:43112.35
Organism:Escherichia coli (strain K12)
Description:ChEMBL_109500
Residue:386
BDBM50030315
NameBDBM50030315
Synonyms:CHEMBL3343827
TypeSmall organic molecule
Emp. Form.C7H2Br2O3S
Mol. Mass.325.962
SMILESOc1c(Br)cc2oc(=O)sc2c1Br