Reaction Details
TargetBifunctional chorismate mutase/prephenate dehydratase
LigandBDBM50030313
Substrate/Competitorn/a
Meas. Tech.ChEMBL_1431488 (CHEMBL3389853)
IC50 85000±n/a nM
Citation Meneely, KMLuo, QRiley, APTaylor, BRoy, AStein, RLPrisinzano, TELamb, AL Expanding the results of a high throughput screen against an isochorismate-pyruvate lyase to enzymes of a similar scaffold or mechanism. Bioorg Med Chem22:5961-9 (2014) 
 
Bifunctional chorismate mutase/prephenate dehydratase
Name:Bifunctional chorismate mutase/prephenate dehydratase
Type:PROTEIN
Mol. Mass.:43112.35
Organism:Escherichia coli (strain K12)
Description:ChEMBL_109500
Residue:386
BDBM50030313
NameBDBM50030313
Synonyms:CHEMBL3343828
TypeSmall organic molecule
Emp. Form.C16H9N3O7S
Mol. Mass.387.324
SMILESOc1c(\C=C2\SC(=O)N(C2=O)c2ccccc2)cc(cc1[N+]([O-])=O)[N+]([O-])=O