Reaction Details
TargetBifunctional chorismate mutase/prephenate dehydratase
LigandBDBM50030314
Substrate/Competitorn/a
Meas. Tech.ChEMBL_1431491 (CHEMBL3389856)
Ki 40000±n/a nM
Citation Meneely, KMLuo, QRiley, APTaylor, BRoy, AStein, RLPrisinzano, TELamb, AL Expanding the results of a high throughput screen against an isochorismate-pyruvate lyase to enzymes of a similar scaffold or mechanism. Bioorg Med Chem22:5961-9 (2014) 
 
Bifunctional chorismate mutase/prephenate dehydratase
Name:Bifunctional chorismate mutase/prephenate dehydratase
Type:PROTEIN
Mol. Mass.:43112.35
Organism:Escherichia coli (strain K12)
Description:ChEMBL_109500
Residue:386
BDBM50030314
NameBDBM50030314
Synonyms:CHEMBL3343825
TypeSmall organic molecule
Emp. Form.C9H4N2O9S
Mol. Mass.316.201
SMILESCOC(=O)Oc1c(cc2oc(=O)sc2c1[N+]([O-])=O)[N+]([O-])=O