Reaction Details
TargetPlatelet-derived growth factor receptor beta
LigandBDBM50030383
Substrate/Competitorn/a
Meas. Tech.ChEMBL_1432459 (CHEMBL3385741)
IC50>200000±n/a nM
Citation Lyu, AFang, LGou, S Design and synthesis of Lapatinib derivatives containing a branched side chain as HER1/HER2 targeting antitumor drug candidates. Eur J Med Chem87:631-42 (2014) 
 
Platelet-derived growth factor receptor beta
Name:Platelet-derived growth factor receptor beta
Type:Enzyme
Mol. Mass.:123922.25
Organism:Homo sapiens (Human)
Description:P09619
Residue:1106
BDBM50030383
NameBDBM50030383
Synonyms:CHEMBL3344216
TypeSmall organic molecule
Emp. Form.C30H28ClFN4O4S
Mol. Mass.595.084
SMILESCN(C)[C@H](CS(C)(=O)=O)c1ccc(o1)-c1ccc2ncnc(Nc3ccc(OCc4cccc(F)c4)c(Cl)c3)c2c1