Reaction Details
TargetMast/stem cell growth factor receptor Kit
LigandBDBM50030379
Substrate/Competitorn/a
Meas. Tech.ChEMBL_1432461 (CHEMBL3385743)
IC50>200000±n/a nM
Citation Lyu, AFang, LGou, S Design and synthesis of Lapatinib derivatives containing a branched side chain as HER1/HER2 targeting antitumor drug candidates. Eur J Med Chem87:631-42 (2014) 
 
Mast/stem cell growth factor receptor Kit
Name:Mast/stem cell growth factor receptor Kit
Type:Protein
Mol. Mass.:109869.37
Organism:Homo sapiens (Human)
Description:P10721
Residue:976
BDBM50030379
NameBDBM50030379
Synonyms:CHEMBL3344210
TypeSmall organic molecule
Emp. Form.C29H26ClFN4O4S
Mol. Mass.581.058
SMILESCNC(CS(C)(=O)=O)c1ccc(o1)-c1ccc2ncnc(Nc3ccc(OCc4cccc(F)c4)c(Cl)c3)c2c1