Reaction Details
TargetVascular endothelial growth factor receptor 2
LigandBDBM50030381
Substrate/Competitorn/a
Meas. Tech.ChEMBL_1432460 (CHEMBL3385742)
IC50>200000±n/a nM
Citation Lyu, AFang, LGou, S Design and synthesis of Lapatinib derivatives containing a branched side chain as HER1/HER2 targeting antitumor drug candidates. Eur J Med Chem87:631-42 (2014) 
 
Vascular endothelial growth factor receptor 2
Name:Vascular endothelial growth factor receptor 2
Type:Receptor Tyrosine Kinase
Mol. Mass.:151510.97
Organism:Homo sapiens (Human)
Description:P35968
Residue:1356
BDBM50030381
NameBDBM50030381
Synonyms:CHEMBL3344219
TypeSmall organic molecule
Emp. Form.C35H36ClFN4O6S
Mol. Mass.695.2
SMILESCCCCCCC(=O)ON[C@H](CS(C)(=O)=O)c1ccc(o1)-c1ccc2ncnc(Nc3ccc(OCc4cccc(F)c4)c(Cl)c3)c2c1