Reaction Details
TargetGenome polyprotein
LigandBDBM50292332
Substrate/Competitorn/a
Meas. Tech.ChEMBL_1434211 (CHEMBL3384589)
IC50 96000±n/a nM
Citation Bhakat, SKarubiu, WJayaprakash, VSoliman, ME A perspective on targeting non-structural proteins to combat neglected tropical diseases: Dengue, West Nile and Chikungunya viruses. Eur J Med Chem87:677-702 (2014) 
 
Genome polyprotein
Name:Genome polyprotein
Type:PROTEIN
Mol. Mass.:380170.63
Organism:West Nile virus
Description:ChEMBL_1438217
Residue:3430
BDBM50292332
NameBDBM50292332
Synonyms:2,3,9,10-Tetramethoxy-5,6-dihydro-isoquino[3,2-a]isoquinolinylium; chloride CHEMBL1270849 CHEMBL274189 PALMATINE
TypeSmall organic molecule
Emp. Form.C21H22NO4
Mol. Mass.352.4031
SMILESCOc1cc2CC[n+]3cc4c(OC)c(OC)ccc4cc3-c2cc1OC