Reaction Details
TargetNuclear receptor ROR-beta
LigandBDBM31883
Substrate/Competitorn/a
Meas. Tech.ChEMBL_1434918 (CHEMBL3385312)
IC50 126±n/a nM
Citation Gege, CSchlüter, THoffmann, T Identification of the first inverse agonist of retinoid-related orphan receptor (ROR) with dual selectivity for RORß and ROR¿t. Bioorg Med Chem Lett24:5265-7 (2014) 
 
Nuclear receptor ROR-beta
Name:Nuclear receptor ROR-beta
Type:PROTEIN
Mol. Mass.:53227.30
Organism:Homo sapiens (Human)
Description:ChEMBL_107979
Residue:470
BDBM31883
NameBDBM31883
Synonyms:9-cis-retinoic acid (9cRA) AT-RA CHEMBL38 SMR000058245 Vitamin A acid [3H]Retinoic acid [3H]tretinoin cid_444795
Typeradiolabeled ligand
Emp. Form.C20H28O2
Mol. Mass.300.4351
SMILESC\C(\C=C\C1=C(C)CCCC1(C)C)=C/C=C/C(/C)=C/C(O)=O