Reaction Details
TargetCarbonic anhydrase 1
LigandBDBM50030564
Substrate/Competitorn/a
Meas. Tech.ChEMBL_1436379 (CHEMBL3389582)
Ki 67±n/a nM
Citation Bozdag, MFerraroni, MCarta, FVullo, DLucarini, LOrlandini, ERossello, ANuti, EScozzafava, AMasini, ESupuran, CT Structural insights on carbonic anhydrase inhibitory action, isoform selectivity, and potency of sulfonamides and coumarins incorporating arylsulfonylureido groups. J Med Chem57:9152-67 (2014) 
 
Carbonic anhydrase 1
Name:Carbonic anhydrase 1
Type:Enzyme
Mol. Mass.:28873.37
Organism:Homo sapiens (Human)
Description:P00915
Residue:261
BDBM50030564
NameBDBM50030564
Synonyms:CHEMBL3354132
TypeSmall organic molecule
Emp. Form.C16H19N3O5S2
Mol. Mass.397.469
SMILESCc1ccc(cc1)S(=O)(=O)NC(=O)NCCc1ccc(cc1)S(N)(=O)=O