Reaction Details
TargetCarbonic anhydrase 12
LigandBDBM50030637
Substrate/Competitorn/a
Meas. Tech.ChEMBL_1436382 (CHEMBL3389585)
Ki 8.9±n/a nM
Citation Bozdag, MFerraroni, MCarta, FVullo, DLucarini, LOrlandini, ERossello, ANuti, EScozzafava, AMasini, ESupuran, CT Structural insights on carbonic anhydrase inhibitory action, isoform selectivity, and potency of sulfonamides and coumarins incorporating arylsulfonylureido groups. J Med Chem57:9152-67 (2014) 
 
Carbonic anhydrase 12
Name:Carbonic anhydrase 12
Type:Enzyme
Mol. Mass.:39456.00
Organism:Homo sapiens (Human)
Description:Catalytic domain of human cloned isozyme was used in the assay
Residue:354
BDBM50030637
NameBDBM50030637
Synonyms:CHEMBL3354139
TypeSmall organic molecule
Emp. Form.C18H16N2O5S
Mol. Mass.372.395
SMILESCc1ccccc1S(=O)(=O)NC(=O)Nc1ccc2c(C)cc(=O)oc2c1