Reaction Details
TargetCarbonic anhydrase 12
LigandBDBM50349858
Substrate/Competitorn/a
Meas. Tech.ChEMBL_1436382 (CHEMBL3389585)
Ki 1.5±n/a nM
Citation Bozdag, MFerraroni, MCarta, FVullo, DLucarini, LOrlandini, ERossello, ANuti, EScozzafava, AMasini, ESupuran, CT Structural insights on carbonic anhydrase inhibitory action, isoform selectivity, and potency of sulfonamides and coumarins incorporating arylsulfonylureido groups. J Med Chem57:9152-67 (2014) 
 
Carbonic anhydrase 12
Name:Carbonic anhydrase 12
Type:Enzyme
Mol. Mass.:39456.00
Organism:Homo sapiens (Human)
Description:Catalytic domain of human cloned isozyme was used in the assay
Residue:354
BDBM50349858
NameBDBM50349858
Synonyms:CHEMBL78755
TypeSmall organic molecule
Emp. Form.C14H15N3O5S2
Mol. Mass.369.416
SMILESCc1ccc(cc1)S(=O)(=O)NC(=O)Nc1ccc(cc1)S(N)(=O)=O