Reaction Details
TargetCarbonic anhydrase 9
LigandBDBM50030625
Substrate/Competitorn/a
Meas. Tech.ChEMBL_1436381 (CHEMBL3389584)
Ki 91±n/a nM
Citation Bozdag, MFerraroni, MCarta, FVullo, DLucarini, LOrlandini, ERossello, ANuti, EScozzafava, AMasini, ESupuran, CT Structural insights on carbonic anhydrase inhibitory action, isoform selectivity, and potency of sulfonamides and coumarins incorporating arylsulfonylureido groups. J Med Chem57:9152-67 (2014) 
 
Carbonic anhydrase 9
Name:Carbonic anhydrase 9
Type:Enzyme
Mol. Mass.:49669.03
Organism:Homo sapiens (Human)
Description:Catalytic domain of human cloned isozyme was used in the assay
Residue:459
BDBM50030625
NameBDBM50030625
Synonyms:CHEMBL3354137
TypeSmall organic molecule
Emp. Form.C17H14N2O5S
Mol. Mass.358.368
SMILESCc1cc(=O)oc2cc(NC(=O)NS(=O)(=O)c3ccccc3)ccc12