Reaction Details
TargetCarbonic anhydrase 2
LigandBDBM50030626
Substrate/Competitorn/a
Meas. Tech.ChEMBL_1436380 (CHEMBL3389583)
Ki>10000±n/a nM
Citation Bozdag, MFerraroni, MCarta, FVullo, DLucarini, LOrlandini, ERossello, ANuti, EScozzafava, AMasini, ESupuran, CT Structural insights on carbonic anhydrase inhibitory action, isoform selectivity, and potency of sulfonamides and coumarins incorporating arylsulfonylureido groups. J Med Chem57:9152-67 (2014) 
 
Carbonic anhydrase 2
Name:Carbonic anhydrase 2
Type:Enzyme
Mol. Mass.:29250.71
Organism:Homo sapiens (Human)
Description:P00918
Residue:260
BDBM50030626
NameBDBM50030626
Synonyms:CHEMBL3354138
TypeSmall organic molecule
Emp. Form.C18H16N2O5S
Mol. Mass.372.395
SMILESCc1ccc(cc1)S(=O)(=O)NC(=O)Nc1ccc2c(C)cc(=O)oc2c1