Reaction Details
TargetCarbonic anhydrase 2
LigandBDBM50030558
Substrate/Competitorn/a
Meas. Tech.ChEMBL_1436380 (CHEMBL3389583)
Ki 40±n/a nM
Citation Bozdag, MFerraroni, MCarta, FVullo, DLucarini, LOrlandini, ERossello, ANuti, EScozzafava, AMasini, ESupuran, CT Structural insights on carbonic anhydrase inhibitory action, isoform selectivity, and potency of sulfonamides and coumarins incorporating arylsulfonylureido groups. J Med Chem57:9152-67 (2014) 
 
Carbonic anhydrase 2
Name:Carbonic anhydrase 2
Type:Enzyme
Mol. Mass.:29250.71
Organism:Homo sapiens (Human)
Description:P00918
Residue:260
BDBM50030558
NameBDBM50030558
Synonyms:CHEMBL3354127
TypeSmall organic molecule
Emp. Form.C13H14N4O5S2
Mol. Mass.370.404
SMILESCc1ccccc1S(=O)(=O)NC(=O)Nc1ccc(nc1)S(N)(=O)=O