Reaction Details
Target3-hydroxy-3-methylglutaryl-coenzyme A reductase
LigandBDBM50321274
Substrate/Competitorn/a
Meas. Tech.ChEMBL_1437081 (CHEMBL3390812)
IC50 6110±n/a nM
Citation Mendieta, AJiménez, FGarduño-Siciliano, LMojica-Villegas, ARosales-Acosta, BVilla-Tanaca, LChamorro-Cevallos, GMedina-Franco, JLMeurice, NGutiérrez, RUMontiel, LECruz, Mdel CTamariz, J Synthesis and highly potent hypolipidemic activity of alpha-asarone- and fibrate-based 2-acyl and 2-alkyl phenols as HMG-CoA reductase inhibitors. Bioorg Med Chem22:5871-82 (2014) 
 
3-hydroxy-3-methylglutaryl-coenzyme A reductase
Name:3-hydroxy-3-methylglutaryl-coenzyme A reductase
Type:Enzyme
Mol. Mass.:97477.10
Organism:Homo sapiens (Human)
Description:P04035
Residue:888
BDBM50321274
NameBDBM50321274
Synonyms:CHEMBL1163189 | Methyl 2-(5-hydroxy-2-methoxy-4-propylphenoxy)acetate
TypeSmall organic molecule
Emp. Form.C13H18O5
Mol. Mass.254.279
SMILESCCCc1cc(OC)c(OCC(=O)OC)cc1O